BDBM9039 1H-Methylindole-3-carboxylic Acid [7-(6-Chloro-1,2,3,4-tetrahydroacridin-9-ylamino)heptyl]amide::Indole-Tacrine Heterodimer 22::N-{7-[(6-chloro-1,2,3,4-tetrahydroacridin-9-yl)amino]heptyl}-1-methyl-1H-indole-3-carboxamide
SMILES Cn1cc(C(=O)NCCCCCCCNc2c3CCCCc3nc3cc(Cl)ccc23)c2ccccc12
InChI Key InChIKey=XLZKWRHITDAXOX-UHFFFAOYSA-N
Data  3 IC50
  Tab Delimited (TSV)   2D SDfile   Computed 3D by Vconf -m prep SDfile
Find this compound or compounds like it in BindingDB:
Activity Spreadsheet -- Enzyme Inhibition Constant Data from BindingDB
Found 3 hits for monomerid = 9039
TargetAcetylcholinesterase(Bos taurus (bovine))
Neuropharma
LigandPNGBDBM9039(1H-Methylindole-3-carboxylic Acid [7-(6-Chloro-1,2...)
Affinity DataIC50:  10.9nMpH: 8.0 T: 2°C. Assay description: The cholinesterase assays were performed using colorimetric method reported by Ellman. The absorbance changes at 405 nm were recorded for 5 min with ...
In DepthDetails ArticlePubMed
TargetAcetylcholinesterase(Homo sapiens (Human))
Sichuan University
Curated by ChEMBL
LigandPNGBDBM9039(1H-Methylindole-3-carboxylic Acid [7-(6-Chloro-1,2...)
Affinity DataIC50:  10.9nM. Assay description: Inhibition of AChE
In DepthDetails ArticlePubMed
TargetCholinesterase(Homo sapiens (Human))
Neuropharma
LigandPNGBDBM9039(1H-Methylindole-3-carboxylic Acid [7-(6-Chloro-1,2...)
Affinity DataIC50:  206nM. Assay description: The cholinesterase assays were performed using colorimetric method reported by Ellman. The absorbance changes at 405 nm were recorded for 5 min with ...
In DepthDetails ArticlePubMed