BDBM91541 3-(3-methoxyphenyl)-2,5-diphenyl-3,4-dihydropyrazole::5-(3-methoxyphenyl)-1,3-diphenyl-2-pyrazoline::VU0467055-1::cid_5079239
SMILES COc1cccc(c1)C1CC(=NN1c1ccccc1)c1ccccc1
InChI Key InChIKey=JPJQKHGGQKIEGI-UHFFFAOYSA-N
Data  3 EC50
  Tab Delimited (TSV)   2D SDfile   Computed 3D by Vconf -m prep SDfile
Find this compound or compounds like it in BindingDB:
Activity Spreadsheet -- Enzyme Inhibition Constant Data from BindingDB
Found 3 hits for monomerid = 91541
TargetBotulinum neurotoxin type A(Clostridium botulinum (strain Hall / ATCC 3502 / N...)
Nmmlsc
Curated by PubChem BioAssay
LigandPNGBDBM91541(3-(3-methoxyphenyl)-2,5-diphenyl-3,4-dihydropyrazo...)
Affinity DataEC50: >2.00E+4nM. Assay description: University of New Mexico Assay Overview: Assay Support: 1 R03 MH093184-01A1 Project Title: High-throughput multiplex microsphere screening for tox...
In DepthDetails PCBioAssay
TargetBotulinum neurotoxin type F(Clostridium botulinum Bf)
Nmmlsc
Curated by PubChem BioAssay
LigandPNGBDBM91541(3-(3-methoxyphenyl)-2,5-diphenyl-3,4-dihydropyrazo...)
Affinity DataEC50: >2.00E+4nM. Assay description: University of New Mexico Assay Overview: Assay Support: 1 R03 MH093184-01A1 Project Title: High-throughput multiplex microsphere screening for tox...
In DepthDetails PCBioAssay
TargetLethal factor(Bacillus anthracis)
Nmmlsc
Curated by PubChem BioAssay
LigandPNGBDBM91541(3-(3-methoxyphenyl)-2,5-diphenyl-3,4-dihydropyrazo...)
Affinity DataEC50: >2.00E+4nM. Assay description: University of New Mexico Assay Overview: Assay Support: 1 R03 MH093184-01A1 Project Title: High-throughput multiplex microsphere screening for tox...
In DepthDetails PCBioAssay