BDBM91556 1,5-diphenyl-3-(p-tolyl)-2-pyrazoline::5-(4-methylphenyl)-2,3-diphenyl-3,4-dihydropyrazole::VU0467044-1::cid_2729179
SMILES Cc1ccc(cc1)C1=NN(C(C1)c1ccccc1)c1ccccc1
InChI Key InChIKey=GDBZFBSFHRVCHG-UHFFFAOYSA-N
Data  3 EC50
  Tab Delimited (TSV)   2D SDfile   Computed 3D by Vconf -m prep SDfile
Find this compound or compounds like it in BindingDB:
Activity Spreadsheet -- Enzyme Inhibition Constant Data from BindingDB
Found 3 hits for monomerid = 91556
TargetBotulinum neurotoxin type A(Clostridium botulinum (strain Hall / ATCC 3502 / N...)
Nmmlsc
Curated by PubChem BioAssay
LigandPNGBDBM91556(1,5-diphenyl-3-(p-tolyl)-2-pyrazoline | 5-(4-methy...)
Affinity DataEC50: >2.00E+4nM. Assay description: University of New Mexico Assay Overview: Assay Support: 1 R03 MH093184-01A1 Project Title: High-throughput multiplex microsphere screening for tox...
In DepthDetails PCBioAssay
TargetBotulinum neurotoxin type F(Clostridium botulinum Bf)
Nmmlsc
Curated by PubChem BioAssay
LigandPNGBDBM91556(1,5-diphenyl-3-(p-tolyl)-2-pyrazoline | 5-(4-methy...)
Affinity DataEC50: >2.00E+4nM. Assay description: University of New Mexico Assay Overview: Assay Support: 1 R03 MH093184-01A1 Project Title: High-throughput multiplex microsphere screening for tox...
In DepthDetails PCBioAssay
TargetLethal factor(Bacillus anthracis)
Nmmlsc
Curated by PubChem BioAssay
LigandPNGBDBM91556(1,5-diphenyl-3-(p-tolyl)-2-pyrazoline | 5-(4-methy...)
Affinity DataEC50: >2.00E+4nM. Assay description: University of New Mexico Assay Overview: Assay Support: 1 R03 MH093184-01A1 Project Title: High-throughput multiplex microsphere screening for tox...
In DepthDetails PCBioAssay