BDBM91571 4-methyl-2-[3-(o-tolyl)-5-phenyl-2-pyrazolin-1-yl]thiazole::4-methyl-2-[5-(2-methylphenyl)-3-phenyl-3,4-dihydropyrazol-2-yl]-1,3-thiazole::4-methyl-2-[5-(2-methylphenyl)-3-phenyl-3,4-dihydropyrazol-2-yl]thiazole::VU0467038-1::cid_50743789
SMILES Cc1csc(n1)N1N=C(CC1c1ccccc1)c1ccccc1C
InChI Key InChIKey=LMZFBENOFPJVCZ-UHFFFAOYSA-N
Data  3 EC50
  Tab Delimited (TSV)   2D SDfile   Computed 3D by Vconf -m prep SDfile
Find this compound or compounds like it in BindingDB:
Activity Spreadsheet -- Enzyme Inhibition Constant Data from BindingDB
Found 3 hits for monomerid = 91571
TargetBotulinum neurotoxin type A(Clostridium botulinum (strain Hall / ATCC 3502 / N...)
Nmmlsc
Curated by PubChem BioAssay
LigandPNGBDBM91571(4-methyl-2-[3-(o-tolyl)-5-phenyl-2-pyrazolin-1-yl]...)
Affinity DataEC50: >2.00E+4nM. Assay description: University of New Mexico Assay Overview: Assay Support: 1 R03 MH093184-01A1 Project Title: High-throughput multiplex microsphere screening for tox...
In DepthDetails PCBioAssay
TargetBotulinum neurotoxin type F(Clostridium botulinum Bf)
Nmmlsc
Curated by PubChem BioAssay
LigandPNGBDBM91571(4-methyl-2-[3-(o-tolyl)-5-phenyl-2-pyrazolin-1-yl]...)
Affinity DataEC50: >2.00E+4nM. Assay description: University of New Mexico Assay Overview: Assay Support: 1 R03 MH093184-01A1 Project Title: High-throughput multiplex microsphere screening for tox...
In DepthDetails PCBioAssay
TargetLethal factor(Bacillus anthracis)
Nmmlsc
Curated by PubChem BioAssay
LigandPNGBDBM91571(4-methyl-2-[3-(o-tolyl)-5-phenyl-2-pyrazolin-1-yl]...)
Affinity DataEC50: >2.00E+4nM. Assay description: University of New Mexico Assay Overview: Assay Support: 1 R03 MH093184-01A1 Project Title: High-throughput multiplex microsphere screening for tox...
In DepthDetails PCBioAssay