BDBM91716 11alpha-Hydroxyandrost-4-en-3,17-dione, 5
SMILES C[C@]12CC[C@@]3(O)[C@@H](CCC4=CC(=O)CC[C@]34C)[C@@H]1CCC2=O
InChI Key InChIKey=SNMVJSSWZSJOGL-PLOWYNNNSA-N
Data  1 IC50
  Tab Delimited (TSV)   2D SDfile   Computed 3D by Vconf -m prep SDfile
Find this compound or compounds like it in BindingDB:
Activity Spreadsheet -- Enzyme Inhibition Constant Data from BindingDB
Found 1 hit for monomerid = 91716
TargetCholinesterase(Homo sapiens (Human))
University Of Jordan
LigandPNGBDBM91716(11alpha-Hydroxyandrost-4-en-3,17-dione, 5)
Affinity DataIC50:  1.41E+5nM. Assay description: AChE and BChE inhibiting activities were measured in vitro by a modified spectrophotometric method previously developed by Ellman et. al.
In DepthDetails ArticlePubMed