BDBM9183 (2R,4S)-2-benzyl-5-[(3S,5R)-3,5-dibenzyl-2-oxopyrrolidin-1-yl]-4-hydroxy-N-[(1S,2R)-2-hydroxy-2,3-dihydro-1H-inden-1-yl]pentanamide::pyrrolidinone based inhibitor 1a::pyrrolidinone scaffold 8b
SMILES O[C@@H](C[C@@H](Cc1ccccc1)C(=O)N[C@@H]1[C@H](O)Cc2ccccc12)CN1[C@@H](Cc2ccccc2)C[C@H](Cc2ccccc2)C1=O
InChI Key InChIKey=JMCYOVXEMFWTCO-YSBXLBHBSA-N
Data  2 KI  1 IC50
  Tab Delimited (TSV)   2D SDfile   Computed 3D by Vconf -m prep SDfile
Find this compound or compounds like it in BindingDB:
Activity Spreadsheet -- Enzyme Inhibition Constant Data from BindingDB
Found 2 hits for monomerid = 9183
TargetDimer of Gag-Pol polyprotein [501-599,Q508K,L534I,L564I,C568A,C596A](Human immunodeficiency virus type 1)
Glaxosmithkline
LigandPNGBDBM9183((2R,4S)-2-benzyl-5-[(3S,5R)-3,5-dibenzyl-2-oxopyrr...)
Affinity DataKi:  0.0500nM ΔG°:  -14.0kcal/molepH: 6.4 T: 2°C. Assay description: The Ki values were determined using fluorogenic substrate, 2-(aminobenzoyl)-Thr-Ile-Nle-Phe(p-NO2)-Gln-ArgNH2. A standard curve relating changes in f...
In DepthDetails ArticlePubMed
TargetDimer of Gag-Pol polyprotein [501-599,Q508K,L534I,L564I,C568A,C596A](Human immunodeficiency virus type 1)
Glaxosmithkline
LigandPNGBDBM9183((2R,4S)-2-benzyl-5-[(3S,5R)-3,5-dibenzyl-2-oxopyrr...)
Affinity DataKi:  0.0500nM ΔG°:  -14.0kcal/mole IC50:  720nMpH: 6.4 T: 2°C. Assay description: The Ki values were determined using fluorogenic substrate, 2-(aminobenzoyl)-Thr-Ile-Nle-Phe(p-NO2)-Gln-ArgNH2. A standard curve relating changes in f...
In DepthDetails ArticlePubMed