BDBM91863 Chk1_14
SMILES Clc1ccc(Nc2ccc3c(Nc4ccccc4NC3=O)c2)cc1
InChI Key InChIKey=CXCRZKMOUJXIMG-UHFFFAOYSA-N
Data  1 KI  1 IC50
  Tab Delimited (TSV)   2D SDfile   Computed 3D by Vconf -m prep SDfile
Find this compound or compounds like it in BindingDB:
Activity Spreadsheet -- Enzyme Inhibition Constant Data from BindingDB
Found 2 hits for monomerid = 91863
TargetSerine/threonine-protein kinase Chk1 [2-280](Homo sapiens (Human))
D3R/Abbott
LigandPNGBDBM91863(Chk1_14)
Affinity DataKi: >1.00E+4nM. Assay description: 33P-Radiometric_Method1
In DepthDetails PubMed
TargetSerine/threonine-protein kinase Chk1(Homo sapiens (Human))
Csar
LigandPNGBDBM91863(Chk1_14)
Affinity DataIC50:  1.00E+4nM. Assay description: Abbott Kinase Enzymatics_CHK1/289 CDC25c - IC50(uM) (IC50)
In DepthDetails PubMed