BDBM91942 Chk1_73
SMILES OC(=O)c1ccc(NC(=O)Nc2cnc(cn2)C#N)c(OC(F)(F)F)c1
InChI Key InChIKey=XSXAAHVRZVBKPR-UHFFFAOYSA-N
Data  1 KI  1 IC50
  Tab Delimited (TSV)   2D SDfile   Computed 3D by Vconf -m prep SDfile
Find this compound or compounds like it in BindingDB:
Activity Spreadsheet -- Enzyme Inhibition Constant Data from BindingDB
Found 2 hits for monomerid = 91942
TargetSerine/threonine-protein kinase Chk1 [2-280](Homo sapiens (Human))
D3R/Abbott
LigandPNGBDBM91942(Chk1_73)
Affinity DataKi:  168nM. Assay description: 33P-Radiometric_Method1
In DepthDetails PubMed
TargetSerine/threonine-protein kinase Chk1(Homo sapiens (Human))
Csar
LigandPNGBDBM91942(Chk1_73)
Affinity DataIC50:  168nM. Assay description: Abbott Kinase Enzymatics_CHK1/289 CDC25c - IC50(uM) (IC50)
In DepthDetails PubMed