BDBM91945 Chk1_77
SMILES CC(C)(C)OC(=O)N1CCC(C1)Oc1ccc(cc1NC(=O)Nc1cnc(cn1)C#N)C#N
InChI Key InChIKey=PRNWBGOUCQROPK-UHFFFAOYSA-N
Data  1 KI  1 IC50
  Tab Delimited (TSV)   2D SDfile   Computed 3D by Vconf -m prep SDfile
Find this compound or compounds like it in BindingDB:
Activity Spreadsheet -- Enzyme Inhibition Constant Data from BindingDB
Found 2 hits for monomerid = 91945
TargetSerine/threonine-protein kinase Chk1 [2-280](Homo sapiens (Human))
D3R/Abbott
LigandPNGBDBM91945(Chk1_77)
Affinity DataKi:  1.53E+3nM. Assay description: 33P-Radiometric_Method1
In DepthDetails PubMed
TargetSerine/threonine-protein kinase Chk1(Homo sapiens (Human))
Csar
LigandPNGBDBM91945(Chk1_77)
Affinity DataIC50:  1.53E+3nM. Assay description: Abbott Kinase Enzymatics_CHK1/289 CDC25c - IC50(uM) (IC50)
In DepthDetails PubMed