BDBM92001 erk000124
SMILES Clc1cc(Cl)cc(c1)-c1c[nH]nc1-c1c[nH]c(c1)C(=O)N1CCOCC1
InChI Key InChIKey=RZBGROYBSMGJDP-SFQUDFHCSA-N
Data  1 KI
  Tab Delimited (TSV)   2D SDfile   Computed 3D by Vconf -m prep SDfile
Find this compound or compounds like it in BindingDB:
Activity Spreadsheet -- Enzyme Inhibition Constant Data from BindingDB
Found 1 hit for monomerid = 92001
TargetMitogen-activated protein kinase 1(Homo sapiens (Human))
Csar
LigandPNGBDBM92001(erk000124)
Affinity DataKi:  813nM. Assay description: Assay 1 ...
In DepthDetails PubMed