BDBM92006 erk000232
SMILES Clc1cccc(c1)-c1c[nH]nc1-c1c[nH]c(c1)C(=O)NCc1ccc2OCCc2c1
InChI Key InChIKey=ATPUGYPATSGLTM-OQKWZONESA-N
Data  1 KI
  Tab Delimited (TSV)   2D SDfile   Computed 3D by Vconf -m prep SDfile
Find this compound or compounds like it in BindingDB:
Activity Spreadsheet -- Enzyme Inhibition Constant Data from BindingDB
Found 1 hit for monomerid = 92006
TargetMitogen-activated protein kinase 1(Homo sapiens (Human))
Csar
LigandPNGBDBM92006(erk000232)
Affinity DataKi:  21nM. Assay description: Assay 1 ...
In DepthDetails PubMed