BDBM92262 CS252
SMILES NC[C@H](NC(=O)c1ccc(cc1)C#CC#Cc1ccccc1)C(=O)NO
InChI Key InChIKey=RMTUQHBOIGEBSC-SFHVURJKSA-N
Data  1 KI  2 Kd
PDB links: 1 PDB ID matches this monomer.
  Tab Delimited (TSV)   2D SDfile   Computed 3D by Vconf -m prep SDfile
Find this compound or compounds like it in BindingDB:
Activity Spreadsheet -- Enzyme Inhibition Constant Data from BindingDB
Found 3 hits for monomerid = 92262
LigandPNGBDBM92262(CS252)
Affinity DataKi:  10nM ΔG°:  -10.9kcal/molepH: 7.0 T: 2°C. Assay description: OctetRed
In DepthDetails PubMed
TargetUDP-3-O-acyl-N-acetylglucosamine deacetylase(Pseudomonas aeruginosa)
D3R/Abbott
LigandPNGBDBM92262(CS252)
Affinity DataKd:  58.6nM. Assay description: Thermofluor_Method1
LigandPNGBDBM92262(CS252)
Affinity DataKd:  59nMpH: 7.0 T: 2°C. Assay description: Thermofluor
In DepthDetails PubMed