BDBM92286 uPa_1
SMILES Nc1cnc2ccccc2n1
InChI Key InChIKey=YOWAEZWWQFSEJD-UHFFFAOYSA-N
Data  2 KI
  Tab Delimited (TSV)   2D SDfile   Computed 3D by Vconf -m prep SDfile
Find this compound or compounds like it in BindingDB:
Activity Spreadsheet -- Enzyme Inhibition Constant Data from BindingDB
Found 2 hits for monomerid = 92286
LigandPNGBDBM92286(uPa_1)
Affinity DataKi: >5.00E+4nM. Assay description: Photometric_Method1
In DepthDetails PubMed
TargetUrokinase-type plasminogen activator(Homo sapiens (Human))
Csar
LigandPNGBDBM92286(uPa_1)
Affinity DataKi: >5.00E+4nM ΔG°: >-5.86kcal/molepH: 7.4 T: 2°C. Assay description: Abbott uPA__Urokinase Human - Ki(uM)
In DepthDetails PubMed