BDBM92295 uPa_2
SMILES COc1cc2ccc(cc2c(OC)c1OC)C(N)=N
InChI Key InChIKey=QLXGNGBLQNIQSM-UHFFFAOYSA-N
Data  2 KI
  Tab Delimited (TSV)   2D SDfile   Computed 3D by Vconf -m prep SDfile
Find this compound or compounds like it in BindingDB:
Activity Spreadsheet -- Enzyme Inhibition Constant Data from BindingDB
Found 2 hits for monomerid = 92295
LigandPNGBDBM92295(uPa_2)
Affinity DataKi:  8.03E+3nM. Assay description: Photometric_Method1
Ligand InfoPC cidPC sid
In DepthDetails PubMed
TargetUrokinase-type plasminogen activator(Homo sapiens (Human))
Csar
LigandPNGBDBM92295(uPa_2)
Affinity DataKi:  8.03E+3nM ΔG°:  -6.95kcal/molepH: 7.4 T: 2°C. Assay description: Abbott uPA__Urokinase Human - Ki(uM)
Ligand InfoPC cidPC sid
In DepthDetails PubMed