BDBM92320 uPa_42
SMILES COc1cc(cc2ccc(cc12)C(N)=N)C1CC1c1ccc2CCN(C)C(C(C)C)c2c1
InChI Key InChIKey=TVHCORBFPYTHHH-UHFFFAOYSA-N
Data  2 KI
  Tab Delimited (TSV)   2D SDfile   Computed 3D by Vconf -m prep SDfile
Find this compound or compounds like it in BindingDB:
Activity Spreadsheet -- Enzyme Inhibition Constant Data from BindingDB
Found 2 hits for monomerid = 92320
LigandPNGBDBM92320(uPa_42)
Affinity DataKi:  94nM. Assay description: Photometric_Method1
In DepthDetails PubMed
TargetUrokinase-type plasminogen activator(Homo sapiens (Human))
Csar
LigandPNGBDBM92320(uPa_42)
Affinity DataKi:  94nM ΔG°:  -9.58kcal/molepH: 7.4 T: 2°C. Assay description: Abbott uPA__Urokinase Human - Ki(uM)
In DepthDetails PubMed