BDBM92471 Sinefungin
SMILES NC(CCC(N)C(O)=O)CC1OC(C(O)C1O)n1cnc2c(N)ncnc12
InChI Key InChIKey=LMXOHSDXUQEUSF-UHFFFAOYSA-N
Data  2 IC50
PDB links: 121 PDB IDs match this monomer.
  Tab Delimited (TSV)   2D SDfile   Computed 3D by Vconf -m prep SDfile
Find this compound or compounds like it in BindingDB:
Activity Spreadsheet -- Enzyme Inhibition Constant Data from BindingDB
Found 2 hits for monomerid = 92471
TargetPhosphoethanolamine N-methyltransferase 2(Caenorhabditis elegans)
Washington University
LigandPNGBDBM92471(Sinefungin)
Affinity DataIC50:  9.15E+4nMpH: 8.0 T: 2°C. Assay description: A radiochemical assay was used to measure enzymatic activity.
In DepthDetails ArticlePubMed
TargetPhosphoethanolamine N-methyltransferase 1(Caenorhabditis elegans)
Washington University
LigandPNGBDBM92471(Sinefungin)
Affinity DataIC50:  3.38E+4nMpH: 8.0 T: 2°C. Assay description: A radiochemical assay was used to measure enzymatic activity.
In DepthDetails ArticlePubMed