BDBM92757 CX-5279
SMILES [O-]C(=O)c1ccc2c(c1)nc(Nc1cccc(c1)C(F)(F)F)c1nc(NC3CC3)ncc21
InChI Key InChIKey=UXZATHOFDZQOMY-UHFFFAOYSA-M
Data  5 IC50
  Tab Delimited (TSV)   2D SDfile   Computed 3D by Vconf -m prep SDfile
Find this compound or compounds like it in BindingDB:
Activity Spreadsheet -- Enzyme Inhibition Constant Data from BindingDB
Found 5 hits for monomerid = 92757
TargetCasein kinase II subunit alpha(Homo sapiens (Human))
Venetian Institute Of Molecular Medicine
LigandPNGBDBM92757(CX-5279)
Affinity DataIC50:  0.910nM. Assay description: Phosphorylation assay using casein kinase 2.
In DepthDetails ArticlePubMed
TargetCasein kinase II subunit alpha(Homo sapiens (Human))
Venetian Institute Of Molecular Medicine
LigandPNGBDBM92757(CX-5279)
Affinity DataIC50:  23.4nM. Assay description: Phosphorylation assay using casein kinase 2.
In DepthDetails ArticlePubMed
TargetSerine/threonine-protein kinase pim-1(Homo sapiens (Human))
Venetian Institute Of Molecular Medicine
LigandPNGBDBM92757(CX-5279)
Affinity DataIC50:  8.52E+3nM. Assay description: Phosphorylation assay using casein kinase 2.
In DepthDetails ArticlePubMed
TargetCasein kinase II subunit alpha(Homo sapiens (Human))
Venetian Institute Of Molecular Medicine
LigandPNGBDBM92757(CX-5279)
Affinity DataIC50:  12.5nM. Assay description: Phosphorylation assay using casein kinase 2.
In DepthDetails ArticlePubMed
TargetCasein kinase II subunit alpha(Homo sapiens (Human))
Venetian Institute Of Molecular Medicine
LigandPNGBDBM92757(CX-5279)
Affinity DataIC50:  13.8nM. Assay description: Phosphorylation assay using casein kinase 2.
In DepthDetails ArticlePubMed