BDBM92765 PDF inhibitor, compound 7
SMILES Cc1ccccc1Nc1nc(nc(n1)N1CCN(CC1)c1ccccc1Cl)N1CSC[C@H]1C(=O)NCC(=O)NO
InChI Key InChIKey=SWGUSXUCDNDAQJ-NRFANRHFSA-N
Data  1 KI
  Tab Delimited (TSV)   2D SDfile   Computed 3D by Vconf -m prep SDfile
Find this compound or compounds like it in BindingDB:
Activity Spreadsheet -- Enzyme Inhibition Constant Data from BindingDB
Found 1 hit for monomerid = 92765
TargetPeptide deformylase(Streptococcus pneumoniae (strain ATCC BAA-255 / R6...)
Glaxosmithkline
LigandPNGBDBM92765(PDF inhibitor, compound 7)
Affinity DataKi:  650nM. Assay description: Binding assay using PDF inhibitors.
In DepthDetails ArticlePubMed