BDBM92875 Quinuclidine analogue, 2
SMILES N[C@@H]1C2CCN(CC2)C1Cc1cccnc1
InChI Key InChIKey=ZUCBDKDJRQVFNO-ZGTCLIOFSA-N
Data  1 Kd
  Tab Delimited (TSV)   2D SDfile   Computed 3D by Vconf -m prep SDfile
Find this compound or compounds like it in BindingDB:
Activity Spreadsheet -- Enzyme Inhibition Constant Data from BindingDB
Found 1 hit for monomerid = 92875
TargetAcetylcholine-binding protein(Lymnaea stagnalis)
Beactica
LigandPNGBDBM92875(Quinuclidine analogue, 2)
Affinity DataKd:  345nMpH: 7.4 T: 2°C. Assay description: Interaction assay using AChBP.
In DepthDetails ArticlePubMed