BDBM92980 Amphiphile, XVII
SMILES CCCCCCCCCCCCCCCCCCCCCCCC(=O)OC(C[NH+](C)C)C[N+](C)(C)C
InChI Key InChIKey=IHTVUEACDXXZHI-UHFFFAOYSA-O
Data  1 IC50
  Tab Delimited (TSV)   2D SDfile   Computed 3D by Vconf -m prep SDfile
Find this compound or compounds like it in BindingDB:
Activity Spreadsheet -- Enzyme Inhibition Constant Data from BindingDB
Found 1 hit for monomerid = 92980
TargetProtein kinase C alpha type(Rattus norvegicus (Rat))
Mcmaster University
LigandPNGBDBM92980(Amphiphile, XVII)
Affinity DataIC50:  4.00E+4nMpH: 7.5 T: 2°C. Assay description: The triton X-100 assay previously described by Bell and co-workers were used to measure enzyme activity.
In DepthDetails ArticlePubMed