BDBM93166 (2-{2-ethyl-1H-pyrrolo[3,2-c]pyridin-3-yl}ethyl)dimethylamine, 24
SMILES CCc1[nH]c2ccncc2c1CCN(C)C
InChI Key InChIKey=SSAOUZNKJBUKRO-UHFFFAOYSA-N
Data  1 KI
  Tab Delimited (TSV)   2D SDfile   Computed 3D by Vconf -m prep SDfile
Find this compound or compounds like it in BindingDB:
Activity Spreadsheet -- Enzyme Inhibition Constant Data from BindingDB
Found 1 hit for monomerid = 93166
Target5-hydroxytryptamine receptor 6(Homo sapiens (Human))
Virginia Commonwealth University
LigandPNGBDBM93166((2-{2-ethyl-1H-pyrrolo[3,2-c]pyridin-3-yl}ethyl)di...)
Affinity DataKi:  2.90E+3nMpH: 7.4Assay Description:The h5-HT6 radioligand binding assays were performed as previously described. In brief, h5-HT6 cDNA was transiently expressed in HEK-293 cells using...
In DepthDetails Article