BDBM93354 PSTQ Analog, 8
SMILES O=S(=O)(c1nnn2c1ncc1ccccc21)c1ccccc1
InChI Key InChIKey=PRJBPLNAZJMZLE-UHFFFAOYSA-N
Data  1 IC50
  Tab Delimited (TSV)   2D SDfile   Computed 3D by Vconf -m prep SDfile
Find this compound or compounds like it in BindingDB:
Activity Spreadsheet -- Enzyme Inhibition Constant Data from BindingDB
Found 1 hit for monomerid = 93354
Target5-hydroxytryptamine receptor 6(Homo sapiens (Human))
Chemical Diversity Research Institute
LigandPNGBDBM93354(PSTQ Analog, 8)
Affinity DataIC50:  5.74E+3nM. Assay description: Radioligand binding assay using 5-HT6R.
Ligand InfoPC cidPC sid
In DepthDetails ArticlePubMed