BDBM93381 PSTQ Analog, 3{8,31}
SMILES CCc1ccccc1Nc1nc2c(nnn2c2ccccc12)S(=O)(=O)c1cc(C)ccc1C
InChI Key InChIKey=ZOOGOSAGNCTVJX-UHFFFAOYSA-N
Data  1 IC50
  Tab Delimited (TSV)   2D SDfile   Computed 3D by Vconf -m prep SDfile
Find this compound or compounds like it in BindingDB:
Activity Spreadsheet -- Enzyme Inhibition Constant Data from BindingDB
Found 1 hit for monomerid = 93381
Target5-hydroxytryptamine receptor 6(Homo sapiens (Human))
Chemical Diversity Research Institute
LigandPNGBDBM93381(PSTQ Analog, 3{8,31})
Affinity DataIC50:  770nM. Assay description: Radioligand binding assay using 5-HT6R.
In DepthDetails ArticlePubMed