BDBM93388 PSTQ Analog, 3{9,53}
SMILES Cc1ccc(cc1C)S(=O)(=O)c1nnn2c1nc(N1CCCCCC1)c1ccccc21
InChI Key InChIKey=JAGCGWYVAJUVFB-UHFFFAOYSA-N
Data  1 IC50
  Tab Delimited (TSV)   2D SDfile   Computed 3D by Vconf -m prep SDfile
Find this compound or compounds like it in BindingDB:
Activity Spreadsheet -- Enzyme Inhibition Constant Data from BindingDB
Found 1 hit for monomerid = 93388
Target5-hydroxytryptamine receptor 6(Homo sapiens (Human))
Chemical Diversity Research Institute
LigandPNGBDBM93388(PSTQ Analog, 3{9,53})
Affinity DataIC50:  1.31E+3nM. Assay description: Radioligand binding assay using 5-HT6R.
In DepthDetails ArticlePubMed