BDBM93393 PSTQ Analog, 3{1,26}
SMILES O=S(=O)(c1nnn2c1nc(NC1CCCCC1)c1ccccc21)c1ccccc1
InChI Key InChIKey=MBTWLFCGYCJEDL-UHFFFAOYSA-N
Data  1 KI  1 IC50
  Tab Delimited (TSV)   2D SDfile   Computed 3D by Vconf -m prep SDfile
Find this compound or compounds like it in BindingDB:
Activity Spreadsheet -- Enzyme Inhibition Constant Data from BindingDB
Found 1 hit for monomerid = 93393
Target5-hydroxytryptamine receptor 6(Homo sapiens (Human))
Chemical Diversity Research Institute
LigandPNGBDBM93393(PSTQ Analog, 3{1,26})
Affinity DataKi:  5.01nM IC50:  10.8nM. Assay description: Radioligand binding assay using 5-HT6R.
In DepthDetails ArticlePubMed