BDBM93416 PHD Inhibitor, 8{6}
SMILES CC(=O)N[C@@H](CC(O)=O)C(=O)NCc1ccc2n(C)c(=O)c(C(=O)NCC(O)=O)c(O)c2c1
InChI Key InChIKey=JOZOULMITAKRSR-LBPRGKRZSA-N
Data  1 IC50
  Tab Delimited (TSV)   2D SDfile   Computed 3D by Vconf -m prep SDfile
Find this compound or compounds like it in BindingDB:
Activity Spreadsheet -- Enzyme Inhibition Constant Data from BindingDB
Found 1 hit for monomerid = 93416
TargetEgl nine homolog 1(Homo sapiens (Human))
Amgen
LigandPNGBDBM93416(PHD Inhibitor, 8{6})
Affinity DataIC50:  138nM. Assay description: PHD1,2,3 activity was measured utilizing homogeneous time-resolved fluroescence energy transfer techology by detecting the trans-4-hydroxylatio of HI...
In DepthDetails ArticlePubMed