BDBM93427 PHD Inhibitor, 12{2,6,2}
SMILES CC(C)C[C@H](NC(C)=O)C(=O)N[C@H](Cc1ccccc1)C(=O)NCc1ccc2n(C)c(=O)c(C(=O)NCC(O)=O)c(O)c2c1
InChI Key InChIKey=DXQATEPEYBQMGM-XZOQPEGZSA-N
Data  3 IC50
  Tab Delimited (TSV)   2D SDfile   Computed 3D by Vconf -m prep SDfile
Find this compound or compounds like it in BindingDB:
Activity Spreadsheet -- Enzyme Inhibition Constant Data from BindingDB
Found 3 hits for monomerid = 93427
TargetEgl nine homolog 1(Homo sapiens (Human))
Amgen
LigandPNGBDBM93427(PHD Inhibitor, 12{2,6,2})
Affinity DataIC50:  67.5nM. Assay description: PHD1,2,3 activity was measured utilizing homogeneous time-resolved fluroescence energy transfer techology by detecting the trans-4-hydroxylatio of HI...
In DepthDetails ArticlePubMed
TargetProlyl hydroxylase EGLN3(Homo sapiens (Human))
Amgen
LigandPNGBDBM93427(PHD Inhibitor, 12{2,6,2})
Affinity DataIC50:  16.2nM. Assay description: PHD1,2,3 activity was measured utilizing homogeneous time-resolved fluroescence energy transfer techology by detecting the trans-4-hydroxylatio of HI...
In DepthDetails ArticlePubMed
TargetProlyl hydroxylase EGLN2(Homo sapiens (Human))
Amgen
LigandPNGBDBM93427(PHD Inhibitor, 12{2,6,2})
Affinity DataIC50:  11nM. Assay description: PHD1,2,3 activity was measured utilizing homogeneous time-resolved fluroescence energy transfer techology by detecting the trans-4-hydroxylatio of HI...
In DepthDetails ArticlePubMed