BDBM93433 PHD Inhibitor, 12{2,1,4}
SMILES Cn1c2ccc(CNC(=O)[C@@H](Cc3ccccc3)NC(=O)[C@@H](Cc3ccc4ccccc4c3)NC(=O)C(C)(C)C)cc2c(O)c(C(=O)NCC(O)=O)c1=O
InChI Key InChIKey=OKHQCLBDLMZWHZ-FIRIVFDPSA-N
Data  3 IC50
  Tab Delimited (TSV)   2D SDfile   Computed 3D by Vconf -m prep SDfile
Find this compound or compounds like it in BindingDB:
Activity Spreadsheet -- Enzyme Inhibition Constant Data from BindingDB
Found 3 hits for monomerid = 93433
TargetEgl nine homolog 1(Homo sapiens (Human))
Amgen
LigandPNGBDBM93433(PHD Inhibitor, 12{2,1,4})
Affinity DataIC50:  308nM. Assay description: PHD1,2,3 activity was measured utilizing homogeneous time-resolved fluroescence energy transfer techology by detecting the trans-4-hydroxylatio of HI...
In DepthDetails ArticlePubMed
TargetProlyl hydroxylase EGLN3(Homo sapiens (Human))
Amgen
LigandPNGBDBM93433(PHD Inhibitor, 12{2,1,4})
Affinity DataIC50:  18.8nM. Assay description: PHD1,2,3 activity was measured utilizing homogeneous time-resolved fluroescence energy transfer techology by detecting the trans-4-hydroxylatio of HI...
In DepthDetails ArticlePubMed
TargetProlyl hydroxylase EGLN2(Homo sapiens (Human))
Amgen
LigandPNGBDBM93433(PHD Inhibitor, 12{2,1,4})
Affinity DataIC50:  60.8nM. Assay description: PHD1,2,3 activity was measured utilizing homogeneous time-resolved fluroescence energy transfer techology by detecting the trans-4-hydroxylatio of HI...
In DepthDetails ArticlePubMed