BDBM9421 (2E)-but-2-enedioic acid; N-methyl-N-[2-(piperidin-4-yl)ethyl]benzamide::Piperidine Derivative 24
SMILES CN(CCC1CCNCC1)C(=O)c1ccccc1
InChI Key InChIKey=WTQIGURXOHWOKR-UHFFFAOYSA-N
Data  1 IC50
  Tab Delimited (TSV)   2D SDfile   Computed 3D by Vconf -m prep SDfile
Find this compound or compounds like it in BindingDB:
Activity Spreadsheet -- Enzyme Inhibition Constant Data from BindingDB
Found 1 hit for monomerid = 9421
TargetAcetylcholinesterase(Mus musculus (mouse))
Tsukuba Research Laboratories
LigandPNGBDBM9421((2E)-but-2-enedioic acid; N-methyl-N-[2-(piperidin...)
Affinity DataIC50:  2.60E+4nM. Assay description: The cholinesterase assays were performed using colorimetric method reported by Ellman. The amount of a yellow substance formed after incubation was d...
In DepthDetails ArticlePubMed