BDBM94325 1-(2-naphthalenylmethyl)-4-piperidinecarboxylic acid ethyl ester::1-(2-naphthylmethyl)isonipecotic acid ethyl ester::MLS001000557::SMR000496061::cid_765394::ethyl 1-(2-naphthylmethyl)-4-piperidinecarboxylate::ethyl 1-(naphthalen-2-ylmethyl)piperidine-4-carboxylate
SMILES CCOC(=O)C1CCN(Cc2ccc3ccccc3c2)CC1
InChI Key InChIKey=QMABPSHLNSASFK-UHFFFAOYSA-N
Data  1 IC50
  Tab Delimited (TSV)   2D SDfile   Computed 3D by Vconf -m prep SDfile
Find this compound or compounds like it in BindingDB:
Activity Spreadsheet -- Enzyme Inhibition Constant Data from BindingDB
Found 1 hit for monomerid = 94325
TargetNeuropilin-1(Homo sapiens (Human))
Burnham Center For Chemical Genomics
Curated by PubChem BioAssay
LigandPNGBDBM94325(1-(2-naphthalenylmethyl)-4-piperidinecarboxylic ac...)
Affinity DataIC50: >9.50E+4nM
In DepthDetails PCBioAssay