BDBM94939 (5-methylpyrazin-2-yl)methyl-[2-(o-anisylamino)thieno[3,2-d]pyrimidin-4-yl]amine::2-N-[(2-methoxyphenyl)methyl]-4-N-[(5-methylpyrazin-2-yl)methyl]thieno[3,2-d]pyrimidine-2,4-diamine::MLS003122852::N2-[(2-methoxyphenyl)methyl]-N4-[(5-methyl-2-pyrazinyl)methyl]thieno[3,2-d]pyrimidine-2,4-diamine::N2-[(2-methoxyphenyl)methyl]-N4-[(5-methylpyrazin-2-yl)methyl]thieno[3,2-d]pyrimidine-2,4-diamine::SMR001278101::cid_49791084
SMILES COc1ccccc1CNc1nc(NCc2cnc(C)cn2)c2sccc2n1
InChI Key InChIKey=HGQZIARXTPJOMP-UHFFFAOYSA-N
Data  3 IC50
  Tab Delimited (TSV)   2D SDfile   Computed 3D by Vconf -m prep SDfile
Find this compound or compounds like it in BindingDB:
Activity Spreadsheet -- Enzyme Inhibition Constant Data from BindingDB
Found 3 hits for monomerid = 94939
TargetLow molecular weight phosphotyrosine protein phosphatase(Homo sapiens (Human))
Burnham Center For Chemical Genomics
Curated by PubChem BioAssay
LigandPNGBDBM94939((5-methylpyrazin-2-yl)methyl-[2-(o-anisylamino)thi...)
Affinity DataIC50:  4.31E+3nM
Ligand InfoPC cidPC sid
In DepthDetails PCBioAssay
TargetTyrosine-protein phosphatase non-receptor type 22(Homo sapiens (Human))
Burnham Center For Chemical Genomics
Curated by PubChem BioAssay
LigandPNGBDBM94939((5-methylpyrazin-2-yl)methyl-[2-(o-anisylamino)thi...)
Affinity DataIC50: >8.00E+4nM
Ligand InfoPC cidPC sid
In DepthDetails PCBioAssay
TargetLow molecular weight phosphotyrosine protein phosphatase(Homo sapiens (Human))
Burnham Center For Chemical Genomics
Curated by PubChem BioAssay
LigandPNGBDBM94939((5-methylpyrazin-2-yl)methyl-[2-(o-anisylamino)thi...)
Affinity DataIC50:  5.74E+3nM
Ligand InfoPC cidPC sid
In DepthDetails PCBioAssay