BDBM95042 6-[2-(butan-2-ylamino)-1,3-thiazol-4-yl]-4H-1,4-benzoxazin-3-one::6-[2-(butan-2-ylamino)-4-thiazolyl]-4H-1,4-benzoxazin-3-one::6-[2-(sec-butylamino)thiazol-4-yl]-4H-1,4-benzoxazin-3-one::MLS000567115::SMR000153854::cid_3570397
SMILES CCC(C)Nc1nc(cs1)-c1ccc2OCC(=O)Nc2c1
InChI Key InChIKey=UFHWZNRPXNLHAW-UHFFFAOYSA-N
Data  2 IC50
  Tab Delimited (TSV)   2D SDfile   Computed 3D by Vconf -m prep SDfile
Find this compound or compounds like it in BindingDB:
Activity Spreadsheet -- Enzyme Inhibition Constant Data from BindingDB
Found 2 hits for monomerid = 95042
TargetLow molecular weight phosphotyrosine protein phosphatase(Homo sapiens (Human))
Burnham Center For Chemical Genomics
Curated by PubChem BioAssay
LigandPNGBDBM95042(6-[2-(butan-2-ylamino)-1,3-thiazol-4-yl]-4H-1,4-be...)
Affinity DataIC50:  1.05E+4nM
In DepthDetails PCBioAssay
TargetLow molecular weight phosphotyrosine protein phosphatase(Homo sapiens (Human))
Burnham Center For Chemical Genomics
Curated by PubChem BioAssay
LigandPNGBDBM95042(6-[2-(butan-2-ylamino)-1,3-thiazol-4-yl]-4H-1,4-be...)
Affinity DataIC50:  6.33E+4nM
In DepthDetails PCBioAssay