BDBM9508 N-(2-methylphenyl)-4-[2-(1,2-oxazol-4-yl)ethyl]-1,3-thiazole-5-carboxamide::N-(Aryl)-thiazole-5-carboxamide 20
SMILES Cc1ccccc1NC(=O)c1scnc1CCc1cnoc1
InChI Key InChIKey=FTSJCDOJMLAHON-UHFFFAOYSA-N
Data  2 IC50
  Tab Delimited (TSV)   2D SDfile   Computed 3D by Vconf -m prep SDfile
Find this compound or compounds like it in BindingDB:
Activity Spreadsheet -- Enzyme Inhibition Constant Data from BindingDB
Found 2 hits for monomerid = 9508
TargetVascular endothelial growth factor receptor 1(Homo sapiens (Human))
Chemical Diversity
LigandPNGBDBM9508(N-(2-methylphenyl)-4-[2-(1,2-oxazol-4-yl)ethyl]-1,...)
Affinity DataIC50: >1.00E+4nM. Assay description: The assay uses purified enzyme interacting with biotinylated peptide substrate. HTRF is based on the proximity of europium cryptate (donor fluorophor...
In DepthDetails ArticlePubMed
TargetVascular endothelial growth factor receptor 2(Homo sapiens (Human))
Chemical Diversity
LigandPNGBDBM9508(N-(2-methylphenyl)-4-[2-(1,2-oxazol-4-yl)ethyl]-1,...)
Affinity DataIC50: >1.00E+4nM. Assay description: The assay uses purified enzyme interacting with biotinylated peptide substrate. HTRF is based on the proximity of europium cryptate (donor fluorophor...
In DepthDetails ArticlePubMed