BDBM9515 N-(Aryl)-thiazole-5-carboxamide 27::N-[4-chloro-3-(trifluoromethyl)phenyl]-4-[2-(pyridin-4-yl)ethyl]-1,3-thiazole-5-carboxamide
SMILES FC(F)(F)c1cc(NC(=O)c2scnc2CCc2ccncc2)ccc1Cl
InChI Key InChIKey=OOSJKYVNWICOCS-UHFFFAOYSA-N
Data  2 IC50
  Tab Delimited (TSV)   2D SDfile   Computed 3D by Vconf -m prep SDfile
Find this compound or compounds like it in BindingDB:
Activity Spreadsheet -- Enzyme Inhibition Constant Data from BindingDB
Found 2 hits for monomerid = 9515
TargetVascular endothelial growth factor receptor 1(Homo sapiens (Human))
Chemical Diversity
LigandPNGBDBM9515(N-(Aryl)-thiazole-5-carboxamide 27 | N-[4-chloro-3...)
Affinity DataIC50:  720nM. Assay description: The assay uses purified enzyme interacting with biotinylated peptide substrate. HTRF is based on the proximity of europium cryptate (donor fluorophor...
In DepthDetails ArticlePubMed
TargetVascular endothelial growth factor receptor 2(Homo sapiens (Human))
Chemical Diversity
LigandPNGBDBM9515(N-(Aryl)-thiazole-5-carboxamide 27 | N-[4-chloro-3...)
Affinity DataIC50:  270nM. Assay description: The assay uses purified enzyme interacting with biotinylated peptide substrate. HTRF is based on the proximity of europium cryptate (donor fluorophor...
In DepthDetails ArticlePubMed