BDBM95196 5-(2,5-dichlorophenyl)-N-[4-(4-morpholinylmethyl)phenyl]-2-furamide::5-(2,5-dichlorophenyl)-N-[4-(4-morpholinylmethyl)phenyl]-2-furancarboxamide::5-(2,5-dichlorophenyl)-N-[4-(morpholin-4-ylmethyl)phenyl]furan-2-carboxamide::5-(2,5-dichlorophenyl)-N-[4-(morpholinomethyl)phenyl]-2-furamide::5-[2,5-bis(chloranyl)phenyl]-N-[4-(morpholin-4-ylmethyl)phenyl]furan-2-carboxamide::MLS000594103::SMR000143162::cid_2043476
SMILES Clc1ccc(Cl)c(c1)-c1ccc(o1)C(=O)Nc1ccc(CN2CCOCC2)cc1
InChI Key InChIKey=XWBCKKPYRUUVQU-UHFFFAOYSA-N
Data  1 IC50
  Tab Delimited (TSV)   2D SDfile   Computed 3D by Vconf -m prep SDfile
Find this compound or compounds like it in BindingDB:
Activity Spreadsheet -- Enzyme Inhibition Constant Data from BindingDB
Found 1 hit for monomerid = 95196
TargetADP-ribosylation factor GTPase-activating protein 1(Rattus norvegicus)
The Scripps Research Institute Molecular Screening Center
Curated by PubChem BioAssay
LigandPNGBDBM95196(5-(2,5-dichlorophenyl)-N-[4-(4-morpholinylmethyl)p...)
Affinity DataIC50: >1.65E+5nM
In DepthDetails PCBioAssay