BDBM95208 2-(5-amino-1-tetrazolyl)-N-[(E)-[5-(2,5-dimethyl-4-nitrophenyl)-2-furanyl]methylideneamino]acetamide::2-(5-aminotetrazol-1-yl)-N-[(E)-[5-(2,5-dimethyl-4-nitro-phenyl)-2-furyl]methyleneamino]acetamide::2-(5-aminotetrazol-1-yl)-N-[(E)-[5-(2,5-dimethyl-4-nitrophenyl)furan-2-yl]methylideneamino]acetamide::2-(5-azanyl-1,2,3,4-tetrazol-1-yl)-N-[(E)-[5-(2,5-dimethyl-4-nitro-phenyl)furan-2-yl]methylideneamino]ethanamide::MLS000711597::SMR000281364::cid_9591176
SMILES Cc1cc(c(C)cc1-c1ccc(\C=N\NC(=O)Cn2nnnc2N)o1)[N+]([O-])=O
InChI Key InChIKey=BENNNZWIYSFIIK-CNHKJKLMSA-N
Data  1 IC50
  Tab Delimited (TSV)   2D SDfile   Computed 3D by Vconf -m prep SDfile
Find this compound or compounds like it in BindingDB:
Activity Spreadsheet -- Enzyme Inhibition Constant Data from BindingDB
Found 1 hit for monomerid = 95208
TargetADP-ribosylation factor GTPase-activating protein 1(Rattus norvegicus)
The Scripps Research Institute Molecular Screening Center
Curated by PubChem BioAssay
LigandPNGBDBM95208(2-(5-amino-1-tetrazolyl)-N-[(E)-[5-(2,5-dimethyl-4...)
Affinity DataIC50:  1.78E+4nM
Ligand InfoPC cidPC sid
In DepthDetails PCBioAssay