BDBM95211 MLS000621169::N-(2,3-dimethylphenyl)-2-(4-ketobenzofuro[3,2-d]pyrimidin-3-yl)acetamide::N-(2,3-dimethylphenyl)-2-(4-oxidanylidene-[1]benzofuro[3,2-d]pyrimidin-3-yl)ethanamide::N-(2,3-dimethylphenyl)-2-(4-oxo-3-benzofuro[3,2-d]pyrimidinyl)acetamide::N-(2,3-dimethylphenyl)-2-(4-oxo-[1]benzofuro[3,2-d]pyrimidin-3-yl)acetamide::N-(2,3-dimethylphenyl)-2-(4-oxo[1]benzofuro[3,2-d]pyrimidin-3(4H)-yl)acetamide::SMR000310336::cid_5168242
SMILES Cc1cccc(NC(=O)Cn2cnc3c4ccccc4oc3c2=O)c1C
InChI Key InChIKey=RKGQNIQBHJAFRY-UHFFFAOYSA-N
Data  1 IC50
  Tab Delimited (TSV)   2D SDfile   Computed 3D by Vconf -m prep SDfile
Find this compound or compounds like it in BindingDB:
Activity Spreadsheet -- Enzyme Inhibition Constant Data from BindingDB
Found 1 hit for monomerid = 95211
TargetADP-ribosylation factor GTPase-activating protein 1(Rattus norvegicus)
The Scripps Research Institute Molecular Screening Center
Curated by PubChem BioAssay
LigandPNGBDBM95211(MLS000621169 | N-(2,3-dimethylphenyl)-2-(4-ketoben...)
Affinity DataIC50:  2.87E+4nM
In DepthDetails PCBioAssay