BDBM95241 MLS001125783::N-[2-methoxy-4-[2-(4-nitrophenoxy)ethanoylamino]phenyl]furan-2-carboxamide::N-[2-methoxy-4-[[2-(4-nitrophenoxy)-1-oxoethyl]amino]phenyl]-2-furancarboxamide::N-[2-methoxy-4-[[2-(4-nitrophenoxy)acetyl]amino]phenyl]-2-furamide::N-[2-methoxy-4-[[2-(4-nitrophenoxy)acetyl]amino]phenyl]furan-2-carboxamide::SMR000659501::cid_1371788
SMILES COc1cc(NC(=O)COc2ccc(cc2)[N+]([O-])=O)ccc1NC(=O)c1ccco1
InChI Key InChIKey=YNKSUBWSGFISLX-UHFFFAOYSA-N
Data  1 IC50
  Tab Delimited (TSV)   2D SDfile   Computed 3D by Vconf -m prep SDfile
Find this compound or compounds like it in BindingDB:
Activity Spreadsheet -- Enzyme Inhibition Constant Data from BindingDB
Found 1 hit for monomerid = 95241
TargetADP-ribosylation factor GTPase-activating protein 1(Rattus norvegicus)
The Scripps Research Institute Molecular Screening Center
Curated by PubChem BioAssay
LigandPNGBDBM95241(MLS001125783 | N-[2-methoxy-4-[2-(4-nitrophenoxy)e...)
Affinity DataIC50:  3.36E+4nM
In DepthDetails PCBioAssay