BDBM95323 4-[4-(2-methoxyphenyl)-6-(trifluoromethyl)-2-pyrimidinyl]morpholine::4-[4-(2-methoxyphenyl)-6-(trifluoromethyl)pyrimidin-2-yl]morpholine::MLS000044539::SMR000022316::US10729695, Compound CB-7::cid_2989573
SMILES COc1ccccc1-c1cc(nc(n1)N1CCOCC1)C(F)(F)F
InChI Key InChIKey=PFXVPQCNGGTFIM-UHFFFAOYSA-N
Data  1 IC50  1 Kd
  Tab Delimited (TSV)   2D SDfile   Computed 3D by Vconf -m prep SDfile
Find this compound or compounds like it in BindingDB:
Activity Spreadsheet -- Enzyme Inhibition Constant Data from BindingDB
Found 2 hits for monomerid = 95323
TargetAdvanced glycosylation end product-specific receptor(Homo sapiens (Human))
The Research Foundation For The State University Of New York
US Patent
LigandPNGBDBM95323(4-[4-(2-methoxyphenyl)-6-(trifluoromethyl)-2-pyrim...)
Affinity DataKd:  0.550nM. Assay description: Day 1Step 1. Add 50 μl anti-mDial (1:160 dilution in 0.1M NaHCO3 pH 9.6)/well. Incubate overnight at 4° C.Day 2Step 2. Use the plate washer to a...
In DepthDetails US Patent
TargetMitochondrial peptide methionine sulfoxide reductase(Bos taurus)
The Scripps Research Institute Molecular Screening Center
Curated by PubChem BioAssay
LigandPNGBDBM95323(4-[4-(2-methoxyphenyl)-6-(trifluoromethyl)-2-pyrim...)
Affinity DataIC50: >1.55E+5nM
In DepthDetails PCBioAssay