BDBM95837 5-(dimethylsulfamoyl)-N-[2-keto-2-(p-toluidino)ethyl]-N-methyl-2-pyrrolidino-benzamide::5-(dimethylsulfamoyl)-N-methyl-N-[2-(4-methylanilino)-2-oxoethyl]-2-(1-pyrrolidinyl)benzamide::5-(dimethylsulfamoyl)-N-methyl-N-[2-(4-methylanilino)-2-oxoethyl]-2-pyrrolidin-1-ylbenzamide::5-(dimethylsulfamoyl)-N-methyl-N-[2-[(4-methylphenyl)amino]-2-oxidanylidene-ethyl]-2-pyrrolidin-1-yl-benzamide::MLS001161558::SMR000716131::cid_16308914
SMILES CN(C)S(=O)(=O)c1ccc(N2CCCC2)c(c1)C(=O)N(C)CC(=O)Nc1ccc(C)cc1
InChI Key InChIKey=OOJZIUINPZKWGL-UHFFFAOYSA-N
Data  1 IC50
  Tab Delimited (TSV)   2D SDfile   Computed 3D by Vconf -m prep SDfile
Find this compound or compounds like it in BindingDB:
Activity Spreadsheet -- Enzyme Inhibition Constant Data from BindingDB
Found 1 hit for monomerid = 95837
TargetMethionine--tRNA ligase(Trypanosoma brucei brucei strain 927/4 GUTat10.1)
The Scripps Research Institute Molecular Screening Center
Curated by PubChem BioAssay
LigandPNGBDBM95837(5-(dimethylsulfamoyl)-N-[2-keto-2-(p-toluidino)eth...)
Affinity DataIC50:  4.27E+3nM
In DepthDetails PCBioAssay