BDBM9608 (R)-N-(1S,2R)-[3-[2-[[(1,1-Dimethylethyl)-amino]carbonyl]phenyl]-2-hydroxy-1-(phenylmethyl)-propyl]-2-amino-4-oxo-4-(benzyloxy)butanamide::Carboxamide analog 3::benzyl (3R)-3-amino-3-{[(2S,3R)-4-[2-(tert-butylcarbamoyl)phenyl]-3-hydroxy-1-phenylbutan-2-yl]carbamoyl}propanoate
SMILES CC(C)(C)NC(=O)c1ccccc1C[C@@H](O)[C@H](Cc1ccccc1)NC(=O)[C@H](N)CC(=O)OCc1ccccc1
InChI Key InChIKey=RKTCQUKRUWVINW-OZNIXHKMSA-N
Data  1 IC50
  Tab Delimited (TSV)   2D SDfile   Computed 3D by Vconf -m prep SDfile
Find this compound or compounds like it in BindingDB:
Activity Spreadsheet -- Enzyme Inhibition Constant Data from BindingDB
Found 1 hit for monomerid = 9608
TargetDimer of Gag-Pol polyprotein [489-587](Human immunodeficiency virus type 1)
Eli Lilly
LigandPNGBDBM9608((R)-N-(1S,2R)-[3-[2-[[(1,1-Dimethylethyl)-amino]ca...)
Affinity DataIC50: >1.00E+3nMpH: 5.5 T: 2°C. Assay description: The assay involves the use of a HIV-1 protease peptide substrate which has been modified to contain a biotin moiety on one side and a fluorescent rep...
In DepthDetails ArticlePubMed