BDBM9628 (S)-N-(1S,2R)-[3-[2-[[(1,1-Dimethylethyl)amino]carbonyl]phenyl]-2-hydroxy-1-(phenylmethyl)-propyl]-2-[(methylsulfonyl)amino]-3-[(p-fluorophenyl)thio]propanamide::D-Cysteine Analog 16g::N-tert-butyl-2-[(2R,3S)-3-[(2S)-3-[(4-fluorophenyl)sulfanyl]-2-methanesulfonamidopropanamido]-2-hydroxy-4-phenylbutyl]benzamide
SMILES CC(C)(C)NC(=O)c1ccccc1C[C@@H](O)[C@H](Cc1ccccc1)NC(=O)[C@@H](CSc1ccc(F)cc1)NS(C)(=O)=O
InChI Key InChIKey=BEPIELKYWZFGIL-UPRLRBBYSA-N
Data  1 IC50
  Tab Delimited (TSV)   2D SDfile   Computed 3D by Vconf -m prep SDfile
Find this compound or compounds like it in BindingDB:
Activity Spreadsheet -- Enzyme Inhibition Constant Data from BindingDB
Found 1 hit for monomerid = 9628
TargetDimer of Gag-Pol polyprotein [489-587](Human immunodeficiency virus type 1)
Eli Lilly
LigandPNGBDBM9628((S)-N-(1S,2R)-[3-[2-[[(1,1-Dimethylethyl)amino]car...)
Affinity DataIC50:  4.40nM. Assay description: The assay involves the use of a HIV-1 protease peptide substrate which has been modified to contain a biotin moiety on one side and a fluorescent rep...
In DepthDetails ArticlePubMed