BDBM96623 4-[(6-bromanyl-1H-benzimidazol-2-yl)amino]-N-(cyclopropylmethyl)benzamide::4-[(6-bromo-1H-benzimidazol-2-yl)amino]-N-(cyclopropylmethyl)benzamide::MLS000560641::SMR000155852::cid_11958560
SMILES Brc1ccc2nc(Nc3ccc(cc3)C(=O)NCC3CC3)[nH]c2c1
InChI Key InChIKey=DAKQEOWIWKAJMO-UHFFFAOYSA-N
Data  2 IC50  2 EC50
  Tab Delimited (TSV)   2D SDfile   Computed 3D by Vconf -m prep SDfile
Find this compound or compounds like it in BindingDB:
Activity Spreadsheet -- Enzyme Inhibition Constant Data from BindingDB
Found 4 hits for monomerid = 96623
TargetGuanine nucleotide-binding protein subunit alpha-15(Homo sapiens (Human))
The Scripps Research Institute Molecular Screening Center
Curated by PubChem BioAssay
LigandPNGBDBM96623(4-[(6-bromanyl-1H-benzimidazol-2-yl)amino]-N-(cycl...)
Affinity DataEC50: >2.99E+4nM
Ligand InfoPC cidPC sid
In DepthDetails PCBioAssay
TargetGuanine nucleotide-binding protein subunit alpha-15(Homo sapiens (Human))
The Scripps Research Institute Molecular Screening Center
Curated by PubChem BioAssay
LigandPNGBDBM96623(4-[(6-bromanyl-1H-benzimidazol-2-yl)amino]-N-(cycl...)
Affinity DataIC50:  1.45E+4nM
Ligand InfoPC cidPC sid
In DepthDetails PCBioAssay
TargetTrace amine-associated receptor 1(Homo sapiens (Human))
The Scripps Research Institute Molecular Screening Center
Curated by PubChem BioAssay
LigandPNGBDBM96623(4-[(6-bromanyl-1H-benzimidazol-2-yl)amino]-N-(cycl...)
Affinity DataEC50:  1.46E+4nM
Ligand InfoPC cidPC sid
In DepthDetails PCBioAssay
TargetTrace amine-associated receptor 1(Homo sapiens (Human))
The Scripps Research Institute Molecular Screening Center
Curated by PubChem BioAssay
LigandPNGBDBM96623(4-[(6-bromanyl-1H-benzimidazol-2-yl)amino]-N-(cycl...)
Affinity DataIC50:  2.09E+3nM
Ligand InfoPC cidPC sid
In DepthDetails PCBioAssay