BDBM96746 2-(2-phenylethylcarbamoyl)bicyclo[2.2.1]heptane-3-carboxylic acid::2-[oxo-(2-phenylethylamino)methyl]-3-bicyclo[2.2.1]heptanecarboxylic acid::3-(phenethylcarbamoyl)norbornane-2-carboxylic acid::3-{[(2-phenylethyl)amino]carbonyl}bicyclo[2.2.1]heptane-2-carboxylic acid::MLS001000987::SMR000499205::cid_6468911
SMILES [H]C12CCC([H])(C1)C(C2C(O)=O)C(=O)NCCc1ccccc1
InChI Key InChIKey=BGECMOWJZQPCEC-UHFFFAOYSA-N
Data  2 IC50  2 EC50
  Tab Delimited (TSV)   2D SDfile   Computed 3D by Vconf -m prep SDfile
Find this compound or compounds like it in BindingDB:
Activity Spreadsheet -- Enzyme Inhibition Constant Data from BindingDB
Found 4 hits for monomerid = 96746
TargetGuanine nucleotide-binding protein subunit alpha-15(Homo sapiens (Human))
The Scripps Research Institute Molecular Screening Center
Curated by PubChem BioAssay
LigandPNGBDBM96746(2-(2-phenylethylcarbamoyl)bicyclo[2.2.1]heptane-3-...)
Affinity DataEC50: >2.99E+4nM
In DepthDetails PCBioAssay
TargetGuanine nucleotide-binding protein subunit alpha-15(Homo sapiens (Human))
The Scripps Research Institute Molecular Screening Center
Curated by PubChem BioAssay
LigandPNGBDBM96746(2-(2-phenylethylcarbamoyl)bicyclo[2.2.1]heptane-3-...)
Affinity DataIC50: >2.99E+4nM
In DepthDetails PCBioAssay
TargetTrace amine-associated receptor 1(Homo sapiens (Human))
The Scripps Research Institute Molecular Screening Center
Curated by PubChem BioAssay
LigandPNGBDBM96746(2-(2-phenylethylcarbamoyl)bicyclo[2.2.1]heptane-3-...)
Affinity DataEC50:  1.26E+3nM
In DepthDetails PCBioAssay
TargetTrace amine-associated receptor 1(Homo sapiens (Human))
The Scripps Research Institute Molecular Screening Center
Curated by PubChem BioAssay
LigandPNGBDBM96746(2-(2-phenylethylcarbamoyl)bicyclo[2.2.1]heptane-3-...)
Affinity DataIC50:  1.10E+4nM
In DepthDetails PCBioAssay