BDBM97359 3-benzyl-6-bromo-2-(4-methylphenyl)imidazo[1,2-a]pyridine::3-benzyl-6-bromo-2-(p-tolyl)imidazo[1,2-a]pyridine::6-bromanyl-2-(4-methylphenyl)-3-(phenylmethyl)imidazo[1,2-a]pyridine::6-bromo-2-(4-methylphenyl)-3-(phenylmethyl)imidazo[1,2-a]pyridine::MLS003269836::SMR001835094::cid_51360054
SMILES Cc1ccc(cc1)-c1nc2ccc(Br)cn2c1Cc1ccccc1
InChI Key InChIKey=YCZZIIZMCRANMC-UHFFFAOYSA-N
Data  2 IC50
  Tab Delimited (TSV)   2D SDfile   Computed 3D by Vconf -m prep SDfile
Find this compound or compounds like it in BindingDB:
Activity Spreadsheet -- Enzyme Inhibition Constant Data from BindingDB
Found 2 hits for monomerid = 97359
TargetSteroidogenic factor 1(Homo sapiens (Human))
The Scripps Research Institute Molecular Screening Center
Curated by PubChem BioAssay
LigandPNGBDBM97359(3-benzyl-6-bromo-2-(4-methylphenyl)imidazo[1,2-a]p...)
Affinity DataIC50: >6.76E+4nM
In DepthDetails PCBioAssay
TargetNuclear receptor subfamily 0 group B member 1(Homo sapiens (Human))
The Scripps Research Institute Molecular Screening Center
Curated by PubChem BioAssay
LigandPNGBDBM97359(3-benzyl-6-bromo-2-(4-methylphenyl)imidazo[1,2-a]p...)
Affinity DataIC50: >6.76E+4nM
In DepthDetails PCBioAssay