BDBM97459 FAAH Inhibitor, 2h
SMILES OCc1ccc(OC(=O)NC2CCCCC2)cc1-c1ccccc1
InChI Key InChIKey=QECZDSOIIYBWIX-UHFFFAOYSA-N
Data  1 IC50
  Tab Delimited (TSV)   2D SDfile   Computed 3D by Vconf -m prep SDfile
Find this compound or compounds like it in BindingDB:
Activity Spreadsheet -- Enzyme Inhibition Constant Data from BindingDB
Found 1 hit for monomerid = 97459
TargetFatty-acid amide hydrolase 1 [30-579](Rattus norvegicus (rat))
Universit?? Degli Studi Di Parma
LigandPNGBDBM97459(FAAH Inhibitor, 2h)
Affinity DataIC50:  46nM. Assay description: Membrane fractions were prepared from Wistar rat brain homogenates, and FAAH activity were assayed by using [3H]anandamide (anandamide[ethanolamine-3...
In DepthDetails ArticlePubMed