BDBM97460 FAAH Inhibitor, 2i
SMILES CN(C)c1ccc(OC(=O)NC2CCCCC2)cc1-c1ccccc1
InChI Key InChIKey=CLQBGHFWBDCVGW-UHFFFAOYSA-N
Data  1 IC50
  Tab Delimited (TSV)   2D SDfile   Computed 3D by Vconf -m prep SDfile
Find this compound or compounds like it in BindingDB:
Activity Spreadsheet -- Enzyme Inhibition Constant Data from BindingDB
Found 1 hit for monomerid = 97460
TargetFatty-acid amide hydrolase 1 [30-579](Rattus norvegicus (rat))
Universit?? Degli Studi Di Parma
LigandPNGBDBM97460(FAAH Inhibitor, 2i)
Affinity DataIC50:  1.59E+3nM. Assay description: Membrane fractions were prepared from Wistar rat brain homogenates, and FAAH activity were assayed by using [3H]anandamide (anandamide[ethanolamine-3...
In DepthDetails ArticlePubMed