BDBM97463 FAAH Inhibitor, 2l
SMILES O=C(NC1CCCCC1)Oc1cccc(Oc2cccc(c2)-c2ccccc2)c1
InChI Key InChIKey=QEKYMHRKMRGICB-UHFFFAOYSA-N
Data  1 IC50
  Tab Delimited (TSV)   2D SDfile   Computed 3D by Vconf -m prep SDfile
Find this compound or compounds like it in BindingDB:
Activity Spreadsheet -- Enzyme Inhibition Constant Data from BindingDB
Found 1 hit for monomerid = 97463
TargetFatty-acid amide hydrolase 1 [30-579](Rattus norvegicus (rat))
Universit?? Degli Studi Di Parma
LigandPNGBDBM97463(FAAH Inhibitor, 2l)
Affinity DataIC50:  2.74E+3nM. Assay description: Membrane fractions were prepared from Wistar rat brain homogenates, and FAAH activity were assayed by using [3H]anandamide (anandamide[ethanolamine-3...
In DepthDetails ArticlePubMed