BDBM97644 US8470837, 12
SMILES Cc1c(Nc2ccc(I)cc2F)c2c(nc[nH]c2=O)n(C)c1=O
InChI Key InChIKey=YYIJQLXUSZWHSA-UHFFFAOYSA-N
Data  1 IC50
  Tab Delimited (TSV)   2D SDfile   Computed 3D by Vconf -m prep SDfile
Find this compound or compounds like it in BindingDB:
Activity Spreadsheet -- Enzyme Inhibition Constant Data from BindingDB
Found 1 hit for monomerid = 97644
TargetDual specificity mitogen-activated protein kinase kinase 1 [2-31,52-393,S218E,S222D](Homo sapiens (Human))
Takeda Pharmaceutical
US Patent
LigandPNGBDBM97644(US8470837, 12)
Affinity DataIC50: <5nMpH: 7.3 T: 2°C. Assay description: Reaction product is determined quantitatively by fluorescent polarization using progressive IMAP beads from Molecular Devices.
In DepthDetails US Patent