BDBM97675 US8476284, 43::US8497277, 15::US9133201, 15::US9181263, 2::US9278100, 2
SMILES CN(C)C\C=C\C(=O)N1CCC[C@H](C1)n1nc(-c2ccc(Oc3ccccc3)cc2)c2c(N)ncnc12
InChI Key InChIKey=IDIZKFVKMFGLPN-FTUXVVSKSA-N
Data  7 IC50
  Tab Delimited (TSV)   2D SDfile   Computed 3D by Vconf -m prep SDfile
Find this compound or compounds like it in BindingDB:
Activity Spreadsheet -- Enzyme Inhibition Constant Data from BindingDB
Found 7 hits for monomerid = 97675
TargetTyrosine-protein kinase BTK(Homo sapiens (Human))
Pharmacyclics
US Patent
LigandPNGBDBM97675(US8476284, 43 | US8497277, 15 | US9133201, 15 | US...)
Affinity DataIC50:  2.5nMpH: 7.4Assay Description:Btk kinase activity was determined using a time-resolved fluorescence resonance energy transfer (TR-FRET) methodology.
In DepthDetails US Patent
TargetTyrosine-protein kinase BTK(Homo sapiens (Human))
Pharmacyclics
US Patent
LigandPNGBDBM97675(US8476284, 43 | US8497277, 15 | US9133201, 15 | US...)
Affinity DataIC50:  2.5nMpH: 7.4Assay Description:Btk kinase activity was determined using a time-resolved fluorescence resonance energy transfer (TR-FRET) methodology.
In DepthDetails US Patent
TargetTyrosine-protein kinase BTK(Homo sapiens (Human))
Pharmacyclics
US Patent
LigandPNGBDBM97675(US8476284, 43 | US8497277, 15 | US9133201, 15 | US...)
Affinity DataIC50:  2.5nMpH: 7.4Assay Description:Btk kinase activity was determined using a time-resolved fluorescence resonance energy transfer (TR-FRET) methodology. Measurements were performed in...
In DepthDetails US Patent
TargetEpidermal growth factor receptor(Homo sapiens (Human))
Pharmacyclics
US Patent
LigandPNGBDBM97675(US8476284, 43 | US8497277, 15 | US9133201, 15 | US...)
Affinity DataIC50:  48.8nM. Assay description: IC50s were determined using the in vitro HotSpot kinase assay (purified enzymes, 33P-ATP, an appropriate substrate and 1 uM ATP.). Reaction condition...
In DepthDetails US Patent
TargetEpidermal growth factor receptor(Homo sapiens (Human))
Pharmacyclics
US Patent
LigandPNGBDBM97675(US8476284, 43 | US8497277, 15 | US9133201, 15 | US...)
Affinity DataIC50:  48.8nM. Assay description: IC50s were determined using the in vitro HotSpot kinase assay (purified enzymes, 33P-ATP, an appropriate substrate and 1 μM ATP.). For enzyme in...
In DepthDetails US Patent
TargetTyrosine-protein kinase BTK(Homo sapiens (Human))
Pharmacyclics
US Patent
LigandPNGBDBM97675(US8476284, 43 | US8497277, 15 | US9133201, 15 | US...)
Affinity DataIC50:  1.10nM. Assay description: IC50s were determined using the in vitro HotSpot kinase assay (purified enzymes, 33P-ATP, an appropriate substrate and 1 uM ATP.). Reaction condition...
In DepthDetails US Patent
TargetTyrosine-protein kinase BTK(Homo sapiens (Human))
Pharmacyclics
US Patent
LigandPNGBDBM97675(US8476284, 43 | US8497277, 15 | US9133201, 15 | US...)
Affinity DataIC50:  1.10nM. Assay description: IC50s were determined using the in vitro HotSpot kinase assay (purified enzymes, 33P-ATP, an appropriate substrate and 1 μM ATP.). For enzyme in...
In DepthDetails US Patent